displayTitle,firstLine,textAuthNumber,hymnalTitle,hymnalID,number,textTitle,refrainFirstLine,authors,composers,meter,tuneTitle,tuneAuthNumber,incipit,languages,textSources,tuneSources
"Let All Things Now Living","Let all things now living a song of thanksgiving",let_all_things_now_living_a_song_of_than,"Worship in Song: A Friends Hymnal",WinS1996,46,"Let All Things Now Living",,"Katharine K. Davis",,"12.11.12.11 D","LLWYN ON",ash_grove,51354311243217551321,,,"Traditional Welsh melody"
"Let All Things Now Living","Let all things now living",let_all_things_now_living_a_song_of_than,"Lift Up Your Hearts: psalms, hymns, and spiritual songs",LUYH2013,5,"Let All Things Now Living",,"Katherine K. Davis","Katherine K. Davis","6.6.11.6.6.11 D","ASH GROVE",ash_grove,51354311243217551321,English,,
"Let All Things Now Living","Let all things now living a song of thanksgiving",let_all_things_now_living_a_song_of_than,"Worship and Rejoice",WAR2003,22,"Let All Things Now Living",,"Katherine K. Davis, 1892-1980",,"12.11.12.11 D","ASH GROVE",ash_grove,51354311243217551321,English,,
"Let All Things Now Living","Let all things now living a song of thanksgiving",let_all_things_now_living_a_song_of_than,"Hymns of Promise: a large print songbook",HOP2015,22,"Let All Things Now Living",,"Katherine K. Davis, 1892-1980",,"12.11.12.11 D","ASH GROVE",ash_grove,51354311243217551321,English,,"Welsh melody"
"Let All Things Now Living (Que todo viviente)","Let all things now living (Que todo viviente)",let_all_things_now_living_a_song_of_than,"Santo, Santo, Santo: cantos para el pueblo de Dios = Holy, Holy, Holy: songs for the people of God",SSS2019,23,"Let All Things Now Living (Que todo viviente)",,"Katherine K. Davis, 1892-1980; Dimas Planas-Belfort, 1834-1992",,"6.6.1.1.6.6.1.1 D","ASH GROVE",ash_grove,51354311243217551321,"English; Spanish",,Welsh
"Let All Things Now Living","Let all things now living",let_all_things_now_living_a_song_of_than,"Hymns for a Pilgrim People: a congregational hymnal",HPP2007,34,"Let All Things Now Living",,"Katherine K. Davis, 1892-1980",,"6.6.11.6.6.11 D","ASH GROVE",ash_grove,51354311243217551321,English,,"Traditional Welsh Melody"
"Let All Things Now Living","Let all things now living",let_all_things_now_living_a_song_of_than,"Glory to God: the Presbyterian Hymnal",GG2013,37,"Let All Things Now Living",,"Katherine K. Davis","Gerald H. Knight","6.6.11.6.6.11 D","ASH GROVE",ash_grove,51354311243217551321,English,,"Welsh folk melody"
"Let All Things Now Living","Let all things now living",let_all_things_now_living_a_song_of_than,"Renew! Songs and Hymns for Blended Worship",RN1995,48,"Let All Things Now Living",,"Katherine K. Davis","Katherine K. Davis","12.11.12.11 D","ASH GROVE",ash_grove,51354311243217551321,English,,
"Let All Things Now Living","Let all things now living a song of thanksgiving",let_all_things_now_living_a_song_of_than,"The Worshiping Church",TWC,53,"Let All Things Now Living",,"Katherine K. Davis","Katharine K. Davis","12.11.12.11 D","ASH GROVE",ash_grove,51354311243217551321,English,,
"Let All Things Now Living","Let all things now living",let_all_things_now_living_a_song_of_than,"With Heart and Voice: songs for all God's children",WHAV1989,121,"Let All Things Now Living",,"Katherine K. Davis","Katherine K. Davis","6.6.1.1.6.6.1.1 D","ASH GROVE",ash_grove,51354311243217551321,English,,Welsh
"Let All Things Now Living","Let all things now living a song of thanksgiving",let_all_things_now_living_a_song_of_than,"Trinity Hymnal (Rev. ed.)",TH1990,125,"Let All Things Now Living",,"Katherine K. Davis","Katherine K. Davis","12.11.12.11 D","ASH GROVE",ash_grove,51354311243217551321,English,,
"Let All Things Now Living","Let all things now living",let_all_things_now_living_a_song_of_than,"Voices United: The Hymn and Worship Book of The United Church of Canada",VU1996,242,"Let All Things Now Living",,"Katherine K. Davis","Katherine K. Davis","6.6.11.6.6.11 D","THE ASH GROVE",ash_grove,51354311243217551321,English,,
"Let All Things Now Living","Let all things now living a song of thanksgiving",let_all_things_now_living_a_song_of_than,"Trinity Psalter Hymnal",TPH2018,254,"Let All Things Now Living",,"Katherine K. Davis","Katherine K. Davis","12.11.12.11 D","ASH GROVE",ash_grove,51354311243217551321,English,,"Traditional Welsh melody"
"Let All Things Now Living","Let all things now living",let_all_things_now_living_a_song_of_than,"Christian Worship (1993): a Lutheran hymnal",CWLH1993,260,"Let All Things Now Living",,"Katherine K. Davis, 1892-1980",,"6.6.1.1.6.6.1.1 D","THE ASH GROVE",ash_grove,51354311243217551321,English,,"Welsh folk tune"
"Let all things now living","Let all things now living a song of thanksgiving",let_all_things_now_living_a_song_of_than,"The Book of Praise",TBP1997,338,"Let all things now living",,"Katherine K. Davis, 1892-1980","Gerald H. Knight, 1908-1979","12.11.12.11 D with repeat","ASH GROVE",ash_grove,51354311243217551321,English,,"Welsh traditional"
"Let All Things Now Living","Let all things now living a song of thanksgiving",let_all_things_now_living_a_song_of_than,"Celebrating Grace Hymnal",CGH2010,379,"Let All Things Now Living",,"Katherine K. Davis",,"12.11.12.11 D","ASH GROVE",ash_grove,51354311243217551321,English,,"Traditional Welsh Melody"
"Let All Things Now Living","Let all things now living a song of thanksgiving",let_all_things_now_living_a_song_of_than,"Common Praise (1998)",CP1998,403,"Let All Things Now Living",,"Katherine K. Davis (1892-1980)",,"12.11.12.11 D","THE ASH GROVE",ash_grove,51354311243217551321,English,,"Welsh trad. "
"Let All Things Now Living","Let all things now living",let_all_things_now_living_a_song_of_than,"Moravian Book of Worship",Mor1995,448,"Let All Things Now Living",,"Katherine K. Davis","Katherine K. Davis","6.6.11.6.6.11 D","ASH GROVE",ash_grove,51354311243217551321,English,,"Welsh folk tune"
"Let All Things Now Living","Let all things now living",let_all_things_now_living_a_song_of_than,"Psalter Hymnal (Gray)",PsH,453,"Let All Things Now Living",,"Katherine K. Davis","Katherine K. Davis","6.6.1.1.6.6.1.1 D","ASH GROVE",ash_grove,51354311243217551321,English,,Welsh
"Let All Things Now Living","Let all things now living",let_all_things_now_living_a_song_of_than,"Lead Me, Guide Me (2nd ed.)",LMGM2012,486,"Let All Things Now Living",,"Katherine K. Davis, 1892-1980","Gerald H. Knight, 1908-1979","6.6.1.1.6.6.1.1 D","ASH GROVE",ash_grove,51354311243217551321,English,,"Welsh melody"
"Let All Things Now Living","Let all things now living",let_all_things_now_living_a_song_of_than,"Christian Worship: Hymnal",CWH2021,507,"Let All Things Now Living",,"Katherine K. Davis, 1892-1980",,"6.6.1.1.6.6.1.1 D","THE ASH GROVE",ash_grove,51354311243217551321,English,,"Welsh; Setting: <cite>Lutheran Book of Worship</cite>, 1978"
"Let All Things Now Living","Let all things now living",let_all_things_now_living_a_song_of_than,"Catholic Book of Worship III",CBOW1994,534,"Let All Things Now Living",,"Katherine K. Davis, 1892-1980",,,"ASH GROVE",ash_grove,51354311243217551321,English,,"Welsh traditional"
"Let All Things Now Living","Let all things now living",let_all_things_now_living_a_song_of_than,"The Presbyterian Hymnal: hymns, psalms, and spiritual songs",PH1990,554,"Let All Things Now Living",,"Katherine K. Davis","Gerald H. Knight","6.6.11.6.6.11 D","ASH GROVE",ash_grove,51354311243217551321,English,,
"Let All Things Now Living","Let all things now living",let_all_things_now_living_a_song_of_than,"Lutheran Book of Worship",LBoW1978,557,"Let All Things Now Living",,"Katherine K. Davis, b. 1892",,"6.6.11.6.6.11 D","THE ASH GROVE",ash_grove,51354311243217551321,English,,"Welsh folk tune"
"Let All Things Now Living","Let all things now living",let_all_things_now_living_a_song_of_than,"Worship (3rd ed.)",WHSB1986,559,"Let All Things Now Living",,"Katherine K. Davis, 1892-1980","Gerald H. Knight, 1908-1979","6.6.1.1.6.6.1.1 D","ASH GRVOE",ash_grove,51354311243217551321,English,,"Welsh "
"Let All Things Now Living","Let all things now living a song of thanksgiving",let_all_things_now_living_a_song_of_than,"Seventh-day Adventist Hymnal",SDAH1985,560,"Let All Things Now Living",,"Katherine E. Davis (1895-1980)","Wayne Hooper (1920-2007)","12.11.12.11 D","THE ASH GROVE",ash_grove,"51354 31124 32175",,,"Traditional Welsh Melody"
"Let All Things Now Living","Let all things now living",let_all_things_now_living_a_song_of_than,"Gather Comprehensive",GC1994,567,"Let All Things Now Living",,"Katherine K. Davis, 1892-1980","Gerald H. Knight, 1908-1979","6.6.11.6.6.11 D","ASH GROVE",ash_grove,51354311243217551321,English,,Welsh
"Let All Things Now Living","Let all things now living",let_all_things_now_living_a_song_of_than,"Breaking Bread (Vol. 39)",BB2020,598,"Let All Things Now Living",,"Katherine K. Davis, 1892-1980",,"6.6.1.1.6.6.1.1 D","ASH GROVE",ash_grove,51354311243217551321,English,,"Trad. Welsh melody"
"Let All Things Now Living","Let all things now living",let_all_things_now_living_a_song_of_than,"Journeysongs (3rd ed.)",JS2012,608,"Let All Things Now Living",,"Katherine K. Davis, 1892-1980","Randall DeBruyn, b. 1947","6.6.1.1.6.6.1.1 D","ASH GROVE",ash_grove,51354311243217551321,English,,"Welsh melody"
"Let All Things Now Living","Let all things now living",let_all_things_now_living_a_song_of_than,"Worship (4th ed.)",WORS2011,636,"Let All Things Now Living",,"Katherine K. Davis, 1892-1980","Gerald H. Knight, 1908-1979","6.6.1.1.6.6.1.1 D","ASH GRVOE",ash_grove,51354311243217551321,English,,"Welsh melody"
"Let All Things Now Living","Let all things now living A song of thanksgiving ",let_all_things_now_living_a_song_of_than,"Baptist Hymnal 1991",BH1991,640,"Let All Things Now Living",,"Katherine K. Davis",,"12.11.12.11 D","ASH GROVE",ash_grove,51354311243217551321,English,,
"Let All Things Now Living","Let all things now living a song of thanksgiving ",let_all_things_now_living_a_song_of_than,"Baptist Hymnal 2008",BH2008,640,"Let All Things Now Living",,"Katherine K. Davis",,"12.11.12.11 D","ASH GROVE",ash_grove,51354311243217551321,English,,"Traditional Welsh Melody"
"Let All Things Now Living","Let all things now living",let_all_things_now_living_a_song_of_than,"Journeysongs (2nd ed.)",JS2003,641,"Let All Things Now Living",,"Katherine K. Davis, 1892-1980",,"6.6.1.1.6.6.1.1 D","ASH GROVE",ash_grove,51354311243217551321,English,,"Trad. Welsh melody"
"Let All Things Now Living","Let all things now living",let_all_things_now_living_a_song_of_than,"Glory and Praise (3rd. ed.)",GAP2015,706,"Let All Things Now Living",,"Katherine K. Davis, 1892-1980","Randall DeBruyn, b. 1947","6.6.1.1.6.6.1.1 D","ASH GROVE",ash_grove,51354311243217551321,English,,"Trad. Welsh melody"
"Let All Things Now Living","Let all things now living",let_all_things_now_living_a_song_of_than,"RitualSong: a hymnal and service book for Roman Catholics",RS1996,707,"Let All Things Now Living",,"Katherine K. Davis, 1892-1980","Gerald H. Knight, 1908-1979","6.6.1.1.6.6.1.1 D","ASH GROVE",ash_grove,51354311243217551321,English,,Welsh
"Let All Things Now Living","Let all things now living",let_all_things_now_living_a_song_of_than,"Chalice Hymnal",CH1995,717,"Let All Things Now Living",,"Katherine K. Davis","Katherine K. Davis","6.6.11.6.6.11 D","ASH GROVE",ash_grove,51354311243217551321,English,,
"Let All Things Now Living","Let all things now living",let_all_things_now_living_a_song_of_than,"Sampler: new hymns and liturgy",SNHL1986,721,"Let All Things Now Living",,"Katherine K. Davis, 1892-1980",,"6.6.11.6.6.11 D","THE ASH GROVE",ash_grove,51354311243217551321,English,,"Welsh folk tune"
"Let All Things Now Living","Let all things now living",let_all_things_now_living_a_song_of_than,"RitualSong (2nd ed.)",RS2016,747,"Let All Things Now Living",,"Katherine K. Davis, 1892-1980","Gerald H. Knight, 1908-1979","6.6.1.1.6.6.1.1 D","ASH GROVE",ash_grove,51354311243217551321,English,,Welsh
"Let All Things Now Living","Let all things now living ",let_all_things_now_living_a_song_of_than,"The Celebration Hymnal: songs and hymns for worship",CEL1997,794,"Let All Things Now Living",,"Kathrine K. Davis","Tom Fettke","6.6.11.6.6.11 D","ASH GROVE",ash_grove,51354311243217551321,English,,"Traditional Welsh Melody"
"Let All Things Now Living","Let all things now living",let_all_things_now_living_a_song_of_than,"Evangelical Lutheran Worship",ELW2006,881,"Let All Things Now Living",,"Katherine K. Davis, 1892-1980",,"6.6.11.6.6.11 D","THE ASH GROVE",ash_grove,51354311243217551321,English,,"Welsh  folk tune"
"Let All Things Now Living","Let all things now living",let_all_things_now_living_a_song_of_than,"One in Faith",OIF2014,895,"Let All Things Now Living",,"Katherine K. Davis, 1892-1980","Charles G. Frischmann","6.6.1.1.6.6.1.1 D","THE ASH GROVE",ash_grove,51354311243217551321,English,,"Traditional Welsh folk melody"
"Let All Things Now Living","Let all things now living",let_all_things_now_living_a_song_of_than,"The Faith We Sing",FWS,2008,"Let All Things Now Living",,"Katherine K. Davis","Katherine K. Davis","6.6.11.6.6.11 D","THE ASH GROVE",ash_grove,51354311243217551321,English,,
"Let All Things Now Living (Que Todo Viveinte)","Let all things now living (Que todo viveinte)",let_all_things_now_living_a_song_of_than,"Oramos Cantando = We Pray In Song",OC2013,538,"Let All Things Now Living (Que Todo Viveinte)",,"Katherine K. Davis, 1892-1980; Dimas Planas-Belfort, 1934-1992","Gerald H. Knight, 1908-1979","6.6.1.1.6.6.1.1 D","ASH GROVE",ash_grove,51354311243217551321,"English; Spanish",,Welsh
"Let All Things Now Living","Let all things now living a song of thanksgiving",let_all_things_now_living_a_song_of_than,"The Covenant Hymnal: a worshipbook",CHWB1996,59,"Let All Things Now Living",,"Katherine K. Davis, 1892-1980","Katherine K. Davis, 1892-1980","12.11.12.11 D","ASH GROVE",ash_grove,51354311243217551321,,,
"Let All Things Now Living","Let all things now living a song of thanksgiving",let_all_things_now_living_a_song_of_than,"Worship His Majesty",WHM1987,78,"Let All Things Now Living",,"Katherine K. Davis; John Cowley","Katherine K. Davis",,"ASH GROVE",ash_grove,51354311243217551321,,,"Traditional Welsh Melody"
"Let All Things Now Living","Let all things now living",let_all_things_now_living_a_song_of_than,"Gather (3rd ed.)",G32011,635,"Let All Things Now Living",,"Katherine K. Davis, 1892-1980","Gerald H. Knight, 1908-1979","6.6.1.1.6.6.1.1 D","ASH GROVE",ash_grove,51354311243217551321,English,,Welsh
"Let All Things Now Living","Let all things now living",let_all_things_now_living_a_song_of_than,"Worship Supplement 2000",WS2000,792,"Let All Things Now Living",,"Katherine K. Davi, 1892-1980",,"6.6.1.1.6.6.1.1 D","THE ASH GROVE",ash_grove,51354311243217551321,English,,
"Let all things now living, a song of thanksgiving","Let all things now living, a song of thanksgiving",let_all_things_now_living_a_song_of_than,"We Celebrate with Song",WCS1976,d104,,,"Katherine K. Davis",,,,,,,,
"Let All Things Now Living","Let all things now living",let_all_things_now_living_a_song_of_than,"Rejoice Hymns",RH2011,63,"Let All Things Now Living",,"Katherine K. Davis, 1892-1980",,"6.6.11.6.6.11 D","ASH GROVE",ash_grove,51354311243217551321,English,,"Traditional Welsh Melody"
"Let All Things Now Living","Let all things now living",let_all_things_now_living_a_song_of_than,"Ambassador Hymnal: for Lutheran worship",AH1994,150,"Let All Things Now Living",,"Katherine K. Davis, 1892-1980",,"12.11.12.11 D","ASH GROVE",ash_grove,51354311243217551321,English,,"Welsh folk tune"
