displayTitle,firstLine,textAuthNumber,hymnalTitle,hymnalID,number,textTitle,refrainFirstLine,authors,composers,meter,tuneTitle,tuneAuthNumber,incipit,languages,textSources,tuneSources
"By the Way of Redeeming Love","O the love so full and free",o_the_love_so_full_and_free,"Tabernacle Praises No. 1",TPN11920,2,"By the Way of Redeeming Love","By the way of redeeming love","A. S. R.","Albert Simpson Reitz",,"[O the love so full and free]",o_the_love_so_full_and_free_reitz,551512312313453,,,
"By the Way of Redeeming Love","Oh, the love so full and free",o_the_love_so_full_and_free,"Tabernacle Hymns: Number Four: a choice collection of hymns and songs for every religious use",TH41952,27,"By the Way of Redeeming Love","By the way of redeeming love","Albert Simpson Reitz","Albert Simpson Reitz",,"[Oh, the love so full and free]",o_the_love_so_full_and_free_reitz,551512312313453,English,,
"By the Way of Redeeming Love","Oh, the love so full and free",o_the_love_so_full_and_free,"The Cyber Hymnal",CYBER,715,"By the Way of Redeeming Love","By the way of redeeming love","Albert Simpson Reitz","Albert Simpson Reitz",,"[Oh, the love so full and free]",o_the_love_so_full_and_free_reitz,551512312313453,English,,
"By the Way of Redeeming Love","Oh, the love so full and free",o_the_love_so_full_and_free,"Tabernacle Hymns: No. 2",TH21921,180,"By the Way of Redeeming Love","By the way of redeeming love","A. S. R.","Albert Simpson Reitz",,"[Oh, the love so full and free]",o_the_love_so_full_and_free_reitz,551512312313453,,,
"By the way of redeeming love","O the love so full and free",o_the_love_so_full_and_free,"Rader Campaign Carols",RCC1924,d35,"By the way of redeeming love",,"Albert Simpson Reitz",,,,,,English,,
"By the way of redeeming love","O the love so full and free",o_the_love_so_full_and_free,"The King's Highway No. 2",KH21925,d50,"By the way of redeeming love",,"Albert Simpson Reitz",,,,,,English,,
"By the way of redeeming love","O the love so full and free",o_the_love_so_full_and_free,"Songs for Jesus",S4J1925,d77,,"By the way of redeeming love","Albert Simpson Reitz",,,,,,English,,
"By the way of redeeming love","O the love so full and free",o_the_love_so_full_and_free,"Carry Away a Song",CAS1940,d81,"By the way of redeeming love",,"Albert Simpson Reitz",,,,,,English,,
"By the way of redeeming love","O the love so full and free",o_the_love_so_full_and_free,"Spiritual hymns of worship",S1957,d338,,"By the way of redeeming love","Albert Simpson Reitz",,,,,,,,
