displayTitle,firstLine,textAuthNumber,hymnalTitle,hymnalID,number,textTitle,refrainFirstLine,authors,composers,meter,tuneTitle,tuneAuthNumber,incipit,languages,textSources,tuneSources
"O worship the Lord in the beauty of holiness","O worship the Lord in the beauty of holiness",o_worship_the_lord_in_the_beauty_of_fear,"Elmhurst Hymnal: and orders of worship for the Sunday school, young people's meetings and church services",EHOW1921,O40a,,,,,,"[O worship the Lord in the beauty of holiness]",o_worship_the_lord_51111,51111765333322,English,,
"O worship the Lord in the beauty of holiness","O worship the Lord in the beauty of holiness",o_worship_the_lord_in_the_beauty_of_fear,"The Pilgrim Hymnal",PH1904,C6,,,,,,"[O worship the Lord in the beauty of holiness]",o_worship_the_lord_51111,51111765333322,English,,
"O worship the Lord in the beauty of holiness","O worship the Lord in the beauty of holiness",o_worship_the_lord_in_the_beauty_of_fear,"The Hymnal for Young People",H4YP1928,305,,,,,,"[O worship the Lord in the beauty of holiness]",o_worship_the_lord_51111,51111765333322,English,,
"Worship the Lord in the beauty of holiness","Worship the Lord in the beauty of holiness",o_worship_the_lord_in_the_beauty_of_fear,"Hymns of the Christian Life",HoCL1925,511,,,,,,"[Worship the Lord in the beauty of holiness]",o_worship_the_lord_51111,51111765333322,English,,
"O Worship the Lord","O worship the Lord in the beauty of holiness",o_worship_the_lord_in_the_beauty_of_fear,"The Pilgrim Hymnal: with responsive readings and other aids to worship",PHRR1912,678,"O Worship the Lord",,,,,"[O worship the Lord in the beauty of holiness]",o_worship_the_lord_51111,51111765333322,,,
"Oh, worship the Lord in the beauty of holiness","Oh, worship the Lord in the beauty of holiness",o_worship_the_lord_in_the_beauty_of_fear,"The Baptist Hymn and Tune Book for Public Worship",BHTB1873,A44,,,,,,,,,,,
"Oh, worship the Lord in the beauty of holiness","Oh, worship the Lord in the beauty of holiness",o_worship_the_lord_in_the_beauty_of_fear,"The Baptist Hymn and Tune Book, for Public Worship",BHTB1871,388,,,,,,,,,,,
"Worship the Lord in the beauty of holiness","Worship the Lord in the beauty of holiness",o_worship_the_lord_in_the_beauty_of_fear,"The Hymnal: Army and Navy",ANH1942,577,,,,,,,,,,,
