displayTitle,firstLine,textAuthNumber,hymnalTitle,hymnalID,number,textTitle,refrainFirstLine,authors,composers,meter,tuneTitle,tuneAuthNumber,incipit,languages,textSources,tuneSources
"Within these walls be peace","Within these walls be peace",within_these_walls_be_peace,"Pilgrim Songs: for the Sunday School",PSSS1886,23,,,,,,"[Within these walls be peace]",st_helena_milgrove,131221575665431,English,,
"Within these walls be peace","Within these walls be peace",within_these_walls_be_peace,"The Psalms, Hymns and Spiritual Songs of the Rev. Isaac Watts, D. D.:  to which are added select hymns, from other authors; and directions for musical expression (New ed.)",PHS1834,D421,,,Montgomery,,,,,,,,
"Within these walls be peace","Within these walls be peace",within_these_walls_be_peace,"Hymns for the Use of the Methodist Episcopal Church. Rev. ed.",HUME1849,S43,,,,,,,,,English,,
"Within these walls be peace","Within these walls be peace",within_these_walls_be_peace,"The New England Sabbath School Minstrel: a collection of music and hymns adapted to sabbath schools, families, and social meetings",NESS1844,7,,,,,,,,,,,
"Within these walls be peace","Within these walls be peace",within_these_walls_be_peace,"Hymns for Sunday Schools, Youth and Children",HSSY1854,11,,,,,,,,,English,,
"Within these walls be peace","Within these walls be peace",within_these_walls_be_peace,"Hymns for Sunday Schools, Youth, and Children",HSSY1857,11,,,,,,,,,English,,
"Within these walls be peace","Within these walls be peace",within_these_walls_be_peace,"Children's Praise: a book of prayers and hymns for the children of the church",CP1858,37,,,Montgomery,,,,,,English,,
"Within these walls be peace","Within these walls be peace",within_these_walls_be_peace,"Sabbath School Choir",SSC1836,d39,,,"James Mongtomery",,,,,,,,
"Within these walls be peace!","Within these walls be peace!",within_these_walls_be_peace,"The Sunday School Singing Book: being a collection of hymns with appropriate music, designed as a guide and assistant to the devotional exercises of Sabbath schools and families...(3rd ed.)",SSSB1845,39,,,,,,,,,,,
"Within these walls be peace","Within these walls be peace",within_these_walls_be_peace,"The Sabbath School: a complete collection of hymns and tunes for Sabbath schools, families, and social gatherings",SSCC1854,41,,,,,,,,,,,
"Within these walls be peace","Within these walls be peace",within_these_walls_be_peace,"Hymns for Sunday Schools, Youth, and Children",HSSY1852,43,,,,,,,,,English,,
"Within these walls be peace","Within these walls be peace",within_these_walls_be_peace,"The Sabbath School Service and Hymn Book",SSSH1855,d63,,,"James Mongtomery",,,,,,,,
"Within these walls be peace","Within these walls be peace",within_these_walls_be_peace,"The Sabbath School Melodist: being a selection of hymns with appropriate music; for the use of Sabbath schools, families and social meetings",SSM1850,75,,,,,,,,,,,
"Within these walls be peace","Within these walls be peace",within_these_walls_be_peace,"The Sabbath School Bell: a new collection of choice hymns and tunes, original and standard; carefully and simply arranged as solos, duets, trios, semi-choruses and choruses, and for organ..(Enl. Ed)",SSB1859,82b,,,,,,,,,,,
"Within these walls be peace","Within these walls be peace",within_these_walls_be_peace,"Hymns and Tunes for Vestry and Conferences. 2nd ed.",HTVC1853,d93,,,"James Mongtomery",,,,,,English,,
"Within these walls be peace","Within these walls be peace",within_these_walls_be_peace,"The Disciples' Hymn Book: a collection of hymns and chants for public and private devotion",DHBC1844,126,,,Montgomery,,,,,,,,
"Within these walls be peace","Within these walls be peace",within_these_walls_be_peace,"The Child's Hymn Book",CHB1820,128,,,Montgomery,,,,,,,,
"Within these walls be peace","Within these walls be peace",within_these_walls_be_peace,"The Sabbath School Lyre: a collection of hymns and music, original and selected, for general use in sabbath schools",SSL1848a,129,,,,,,,,,,,
"Within these walls be peace","Within these walls be peace",within_these_walls_be_peace,"The Sabbath School Lute: a selection of hymns and appropriate melodies, adapted to the wants of Sabbath schools, families and social meetings",SSL1848,134,,,,,,,,,,,
"Within these walls be peace","Within these walls be peace",within_these_walls_be_peace,"The Westminster Collection of Sabbath School Hymns and Tunes",WCSS1859,d141,,,"James Mongtomery",,,,,,,,
"Within these walls be peace","Within these walls be peace",within_these_walls_be_peace,"The Sabbath School Lyre",SSL1856,d191,,,"James Mongtomery",,,,,,,,
"Within these walls be peace","Within these walls be peace",within_these_walls_be_peace,"Massachusetts Sabbath School Hymn Book",MSSH1843,d214,,,"James Mongtomery",,,,,,English,,
"Within these walls be peace","Within these walls be peace",within_these_walls_be_peace,"The Anniversary and Sunday School Music Book No. 1-5",ASSM1858,d215,,,"James Mongtomery",,,,,,English,,
"Within these walls be peace","Within these walls be peace",within_these_walls_be_peace,"The Presbyterian Juvenile Psalmodist",PJP1856,236,,,,,,,,,,,
"Within these walls be peace","Within these walls be peace",within_these_walls_be_peace,"Vestry Songs",VS1854,d237,,,"James Mongtomery",,,,,,,,
"Within these walls be peace","Within these walls be peace",within_these_walls_be_peace,"Youthful Voices",YV1862,d255,,,"James Mongtomery",,,,,,,,
"Within these walls be peace","Within these walls be peace",within_these_walls_be_peace,"Hymns for Youth, Suitable to be Used in Sabbath and Parochial Schools",HYSU1848,279,,,,,,,,,English,,
"Within these walls be peace","Within these walls be peace",within_these_walls_be_peace,"Templi Carmina",TC1853,d288,,,"James Mongtomery",,,,,,,,
"Within these walls be peace","Within these walls be peace",within_these_walls_be_peace,"The School Psalter",SP1864,d332,,,"James Mongtomery",,,,,,,,
"Within these walls be peace","Within these walls be peace",within_these_walls_be_peace,"The Christian Minstrel: a New System of Musical Notation with a Collection of Psalm Tunes, Anthems, and Chants. 3rd ed.",CMNS1846,d341,,,"James Mongtomery",,,,,,,,
"Within these walls be peace","Within these walls be peace",within_these_walls_be_peace,"The Choralist",C1859,d404,,,"James Mongtomery",,,,,,,,
"Within these walls be peace","Within these walls be peace",within_these_walls_be_peace,"The Golden Harp",GH1858,d409,,,"James Mongtomery",,,,,,,,
"Within these walls be peace","Within these walls be peace",within_these_walls_be_peace,"The Chapel Hymn Book.  5th ed.",CHB51845,d420,,,"James Mongtomery",,,,,,,,
"Within these walls be peace","Within these walls be peace",within_these_walls_be_peace,"The New Congregational Hymn and Tune Book, for Public, Social and Private  Worship",NCHT1859,426,,,Montgomery,,,,,,,,
"Within these walls be peace","Within these walls be peace",within_these_walls_be_peace,"The Christian Psalmist; or, Watts' Psalms and Hymns: with copious selections from other sources; the whole carefully revised and arranged, with directions for musical expression",CPWP1836,435,,,Montgomery,,,,,,,,
"Within these walls be peace","Within these walls be peace",within_these_walls_be_peace,"A Collection of Psalms and Hymns for Christian Worship",CPHC1830,489,,,Montgomery,,,,,,English,,
"Within these walls be peace","Within these walls be peace",within_these_walls_be_peace,"A Collection of Psalms and Hymns for Christian Worship. (45th ed.)",CPHC1846,489,,,Montgomery,,,,,,English,,
"Within these walls be peace","Within these walls be peace",within_these_walls_be_peace,"A Collection of Psalms and Hymns for Christian Worship. (3rd ed.)",CPHC1831,489,,,Montgomery,,,,,,English,,
"Within these walls be peace","Within these walls be peace",within_these_walls_be_peace,"A Collection of Psalms and Hymns for Christian Worship (6th ed.)",CPHC1832,489,,,Montgomery,,6.6.8.6,,,,English,,
"Within these walls be peace","Within these walls be peace",within_these_walls_be_peace,"A Collection of Psalms and Hymns for Christian Worship (10th ed.)",CPHC1833,489,,,Montgomery,,6.6.8.6,,,,English,,
"Within these walls be peace","Within these walls be peace",within_these_walls_be_peace,"A Collection of Psalms and Hymns for Christian Worship. 16th ed.",CPHC1835,489,,,Montgomery,,6.6.8.6,,,,English,,
"Within these walls be peace","Within these walls be peace",within_these_walls_be_peace,"The Union Harp and Revival Chorister. Rev ed.",UHRC1860,d492,,,"James Mongtomery",,,,,,,,
"Within these walls be peace","Within these walls be peace",within_these_walls_be_peace,"Union Hymns. Rev.",UHR1835,d502,,,"James Mongtomery",,,,,,,,
"Within these walls be peace!","Within these walls be peace!",within_these_walls_be_peace,"The Springfield Collection of Hymns for Sacred Worship",SCHS1835,503,,,Montgomery,,,,,,,,
"Within these walls be peace","Within these walls be peace",within_these_walls_be_peace,"The Baptist Sabbath School Hymn Book",BSSH1851,d504,,,"James Mongtomery",,,,,,,,
"Within these walls be peace","Within these walls be peace",within_these_walls_be_peace,"Hymns for Children and Young Persons",HCYP1854,d506,,,"James Mongtomery",,,,,,English,,
"Within these walls be peace","Within these walls be peace",within_these_walls_be_peace,"The American Baptist Sabbath-School Hymn-Book",ABSS1844,513,,,,,,,,,,,
"Within these walls be peace","Within these walls be peace",within_these_walls_be_peace,"Union Hymns. Rev.",UHR1845,d517,,,"James Mongtomery",,,,,,,,
"Within these walls be peace","Within these walls be peace",within_these_walls_be_peace,"Songs for Social and Public Worship",SSPW1863,544,,,,,,,,,,,
"Within these walls be peace","Within these walls be peace",within_these_walls_be_peace,"The Vestry Hymn Book",VHB1858,d563,,,"James Mongtomery",,,,,,,,
