displayTitle,firstLine,textAuthNumber,hymnalTitle,hymnalID,number,textTitle,refrainFirstLine,authors,composers,meter,tuneTitle,tuneAuthNumber,incipit,languages,textSources,tuneSources
"Apertura del culto (Llamados a la adoración)","Del Señor es la tierra y todo lo que hay en ella",readings,"Celebremos Su Gloria",CSG1992,642,"Apertura del culto (Llamados a la adoración)",,,,,,,,Spanish,,
"O Praise God in His Holy Place","O praise the Lord. O praise God in his holy place,",readings,"Seventh-day Adventist Hymnal",SDAH1985,707,"O Praise God in His Holy Place",,,,,,,,,,
"O for a Thousand Tongues to Sing","O for a thousand tongues to sing",o_for_a_thousand_tongues_to_sing_my,"The Covenant Hymnal: a worshipbook",CHWB1996,299,"O for a Thousand Tongues to Sing",,"Charles Wesley, 1707-1788","Carl G. Gläser, 1784-1829; Lowell Mason, 1792-1872",8.6.8.6,AZMON,azmon_glaser,511223212334325,,,
"From all that dwell below the skies","From all that dwell below the skies",from_all_that_dwell_below_the_skies,"Hymns and Tunes: for Public and Private Worship, and Sunday Schools",HTPP1890,251,,,"I. Watts","L. O. Emerson",,WESTON,sessions_emerson,565156512322322,English,,
"From All That Dwell Below the Skies (Psalm  117)","From all that dwell below the skies",from_all_that_dwell_below_the_skies,"Glory to God: the Presbyterian Hymnal",GG2013,327,"From All That Dwell Below the Skies (Psalm  117)",,"Isaac Watts","Ralph Vaughan Williams","8.8.8.8 with alleluias","LASST UNS ERFREUEN",lasst_uns_erfreuen,112313451123134,English,"Stanza 2, <i>A Pocket Hymn Book</i>, 1781","<i>Geistliche Kirchengesäng</i>, 1623, alt."
"From All That Dwell Below the Skies","From all that dwell below the skies",from_all_that_dwell_below_the_skies,"Common Praise (1998)",CP1998,344,"From All That Dwell Below the Skies",,"Isaac Watts (1674-1748)","Ralph Vaughan Williams (1872-1958)","8.8.8.8 with alleluias","LASST UNS ERFREUEN",lasst_uns_erfreuen,112313451123134,English,,"<cite> Geistliche Kirchengesänge</cite>, Köln, 1623"
"From All That Dwell Below the Skies","From all that dwell below the skies",from_all_that_dwell_below_the_skies,"Moravian Book of Worship",Mor1995,551,"From All That Dwell Below the Skies",,"Isaac Watts; Anonymous","Louis Bourgeois",8.8.8.8,"OLD HUNDREDTH",old_hundredth_bourgeois,117651233332143,English,,"Genevan Psalter (1551) original form"
"From All That Dwell below the Skies (Praise God, from Whom All Blessings Flow)","From all that dwell below the skies",from_all_that_dwell_below_the_skies,"Journeysongs (3rd ed.)",JS2012,569,"From All That Dwell below the Skies (Praise God, from Whom All Blessings Flow)",,"Isaac Watts, 1674-1748; Anon.; Thomas Ken, 1637-1711","Louis Bourgeois, ca. 1510-1561; Randall DeBruyn, b. 1947",8.8.8.8,"OLD HUNDREDTH",old_hundredth_bourgeois,117651233332143,English,," <cite>Genevan Psalter</cite>, 1551"
"From All That Dwell Below The Skies (Praise God from Whom All Blessings Flow)","From all that dwell below the skies",from_all_that_dwell_below_the_skies,"Glory and Praise (3rd. ed.)",GAP2015,718,"From All That Dwell Below The Skies (Praise God from Whom All Blessings Flow)",,"Isaac Watts, 1674-1748; Anon. ; Thomas Ken, 1637-1711","Louis Bourgeois, ca.1510-1561; Randall DeBruyn, b. 1947",8.8.8.8,"OLD HUNDREDTH",old_hundredth_bourgeois,117651233332143,English,,"<cite>Genevan Psalter</cite>, 1551"
Doxology,"Praise God from whom all blessings flow",praise_god_from_whom_all_blessings_ken,"Worship the Lord: Hymnal of the Church of God",WtL1989,8,Doxology,,"Thomas Ken","John Hutton",8.8.8.8,"DUKE STREET",duke_street_hatton,134567176555565,,,
"Praise God, from Whom All Blessings Flow","Praise God, from whom all blessings flow",praise_god_from_whom_all_blessings_ken,"Songs for Life",SFL,11,"Praise God, from Whom All Blessings Flow",,"Thomas Ken","Louis Bourgeois",8.8.8.8,"OLD HUNDREDTH",old_hundredth_bourgeois,117651233332143,English,,
Doxology,"Praise God from whom all blessings flow",praise_god_from_whom_all_blessings_ken,"Worship the Lord: Hymnal of the Church of God",WtL1989,21,Doxology,,"Thomas Ken","Louis Bourgeois",8.8.8.8,"OLD HUNDREDTH",old_hundredth_bourgeois,117651233332143,,,"Genevan Psalter"
"Praise God from Whom All Blessings Flow","Praise God from whom all blessings flow",praise_god_from_whom_all_blessings_ken,"Worship and Rejoice",WAR2003,34,"Praise God from Whom All Blessings Flow",,"Thomas Ken, 1637-1711","Louis Bourgeois, ca. 1510-1561",8.8.8.8,"OLD 100th",old_hundredth_bourgeois,117651233332143,English,<i>Doxology</i>,
Doxology,"Praise God from Whom All Blessings Flow",praise_god_from_whom_all_blessings_ken,"Worship and Rejoice",WAR2003,44,Doxology,,"Jimmy Owens, 1930-","Jimmy Owens, 1930-",,"[Praise God from whom all blessings flow]",fairhill_owens,5123455654554,English,,
"Praise God From Whom All Blessings","Praise God from whom all blessing flow",praise_god_from_whom_all_blessings_ken,"Great Songs of the Church (Revised)",GSC1986,73,"Praise God From Whom All Blessings",,"Thomas Ken",,,"OLD HUNDREDTH",old_hundredth_bourgeois,117651233332143,English,,"alt., <em>Genevan Psalter</em>, 1551"
"Praise God, from Whom All Blessings Flow","Praise God from whom all blessings flow",praise_god_from_whom_all_blessings_ken,"This Far By Faith: an African American resource for worship",TFBF1999,276,"Praise God, from Whom All Blessings Flow",,"Thomas Ken, 1637-1711; Isaac Watts, 1674-1748; William Kethe, d. 1593","John Hatton, d. 1793; George Coles; Roberta Martin, 1912-1969",,"[Praise God from whom all blessings flow]",praise_god_from_whom_all_blessing_martin,13456717651345543213,English,,
"Praise God, from Whom All Blessings Flow.","Praise God, from whom all blessings flow",praise_god_from_whom_all_blessings_ken,"Psalter Hymnal (Blue)",BPsH,493,"Praise God, from Whom All Blessings Flow.",,"Bishop Thomas Ken","Louis Bourgeois",8.8.8.8,"OLD HUNDREDTH",old_hundredth_bourgeois,117651233332143,English,,
"Praise God from Whom All Blessings Flow","Praise God, from whom all blessings flow",praise_god_from_whom_all_blessings_ken,"Praise for the Lord (Expanded Edition)",PFTL1997,528,"Praise God from Whom All Blessings Flow",,"Thomas Ken",,8.8.8.8,"OLD HUNDREDTH",old_hundredth_bourgeois,117651233332143,English,,"Bourgeois's Genevan Psalter</i>, 1551"
"Praise God from Whom All Blessings Flow","Praise God from whom all blessings flow",praise_god_from_whom_all_blessings_ken,"Hymns of Faith",HHOF1980,554,"Praise God from Whom All Blessings Flow",,"Thomas Ken",,,"[Praise God from whom all blessings flow]",old_hundredth_bourgeois,117651233332143,English,Doxology,
Doxology,"Praise God from whom all blessings flow",praise_god_from_whom_all_blessings_ken,"Trinity Psalter Hymnal",TPH2018,567,Doxology,,"Thomas Ken","Louis Bourgeois",8.8.8.8,"OLD HUNDREDTH",old_hundredth_bourgeois,117651233332143,English,,
Doxology,"Praise God from whom all blessings flow",praise_god_from_whom_all_blessings_ken,"Trinity Psalter Hymnal",TPH2018,568,Doxology,,"Thomas Ken","Louis Bourgeois",8.8.8.8,"GENEVAN 134 (OLD HUNDREDTH)",old_hundredth_bourgeois,117651233332143,English,,
Doxology,"Praise God from whom all blessings flow",praise_god_from_whom_all_blessings_ken,"Trinity Psalter Hymnal",TPH2018,569,Doxology,,"Thomas Ken","Thomas Tallis",8.8.8.8,"TALLIS' CANON",tallis_canon,117112234314433221,English,,
Doxology,"Praise God from whom all blessings flow",praise_god_from_whom_all_blessings_ken,"Trinity Psalter Hymnal",TPH2018,570,Doxology,,"Thomas Ken",,"8.8.8.8 with alleluias","LASST UNS ERFREUEN",lasst_uns_erfreuen,112313451123134,English,,"<cite>Geistliche Kirchengesänge</cite> Cologne, 1623"
"Praise God from Whom All Blessings","Praise God from whom all blessings flow",praise_god_from_whom_all_blessings_ken,"Hymns for the Living Church",HFLC1974,572,"Praise God from Whom All Blessings",,"Thomas Ken",,8.8.8.8,"OLD 100TH",old_hundredth_bourgeois,117651233332143,English,Doxology,
"Praise God, from Whom All Blessings Flow","Praise God, from whom all blessings flow",praise_god_from_whom_all_blessings_ken,"The Lutheran Hymnal",LH1941,644,"Praise God, from Whom All Blessings Flow",,"Thomas Ken",,8.8.8.8,"OLD HUNDREDTH",old_hundredth_bourgeois,117651233332143,English,,"""Genevan Psalter,"" 1551"
"Praise God, from Whom All Blessings Flow (A Dios, el Padre celestial)","Praise God, from whom all blessings flow (A Dios, el Padre celestial)",praise_god_from_whom_all_blessings_ken,"Santo, Santo, Santo: cantos para el pueblo de Dios = Holy, Holy, Holy: songs for the people of God",SSS2019,696,"Praise God, from Whom All Blessings Flow (A Dios, el Padre celestial)",,"Thomas Ken, 1637-1711; Anonymous; Martin Luther, 1483-1546; Sarah Poulton Kalley; Ambrose, 340-397; J. W. Nordholt","Louis Bourgeois, c.1510-1561",8.8.8.8,"OLD HUNDREDTH",old_hundredth_bourgeois,117651233332143,"Cherokee; Dutch; English; French; German; Japanese; Korean; Mandarin; Mohawk; Navajo; Portuguese; Spanish","Cherokee, tr. traditional; Mohawk tr. traditional",
Doxology,"Praise God from whom all blessings flow",praise_god_from_whom_all_blessings_ken,"Trinity Hymnal (Rev. ed.)",TH1990,731,Doxology,,"Thomas Ken",,8.8.8.8,"OLD HUNDREDTH",old_hundredth_bourgeois,117651233332143,English,,"Louis Bourgeois's <i>Genevan Psalter, </i>1551"
Doxology,"Praise God from whom all blessings flow",praise_god_from_whom_all_blessings_ken,"Trinity Hymnal (Rev. ed.)",TH1990,732,Doxology,,"Thomas Ken","Thomas Tallis",8.8.8.8,"TALLIS' CANON",tallis_canon,117112234314433221,English,,
Doxology,"Praise God from whom all blessings flow",praise_god_from_whom_all_blessings_ken,"Trinity Hymnal (Rev. ed.)",TH1990,733,Doxology,,"Thomas Ken",,"8.8.8.8 with alleluias","LASST UNS ERFREUEN",lasst_uns_erfreuen,112313451123134,English,,"<i>Geistlich Kirchengesäng</i>, Cologne, 1623"
"Praise God, from whom all blessings flow","Praise God, from whom all blessings flow",praise_god_from_whom_all_blessings_ken,"Together in Song: Australian hymn book II",TIS1999,768a,,,"Thomas Ken, 1637-1711",,8.8.8.8,"OLD 100TH",old_hundredth_bourgeois,117651233332143,English,,"'Genevan Psalter', 1551 (English rhythmic form of last line)"
"Praise God, from whom all blessings flow","Praise God, from whom all blessings flow",praise_god_from_whom_all_blessings_ken,"Together in Song: Australian hymn book II",TIS1999,768b,,,"Thomas Ken, 1637-1711","Jimmy Owens, 1930-",8.8.8.8,FAIRHILL,fairhill_owens,5123455654554,English,,
"Praise God, from Whom All Blessings Flow","Praise God, from whom all blessings flow",praise_god_from_whom_all_blessings_ken,"Lutheran Service Book",LSB2006,805,"Praise God, from Whom All Blessings Flow",,"Thomas Ken, 1637-1711",,8.8.8.8,"OLD HUNDREDTH",old_hundredth_bourgeois,117651233332143,English,,"<cite>Trente quatre Pseaumes de David,</cite> Geneva, 1551, ed. Louis Bourgeois"
"Praise God from Whom All Blessings","Praise God from whom all blessings flow",praise_god_from_whom_all_blessings_ken,"The Worshiping Church",TWC,808,"Praise God from Whom All Blessings",,"Thomas Ken",,8.8.8.8,"OLD HUNDREDTH",old_hundredth_bourgeois,117651233332143,English,<cite>Doxology</cite>,
"Praise God from Whom All Blessings","Praise God from whom all blessings flow",praise_god_from_whom_all_blessings_ken,"The Worshiping Church",TWC,809,"Praise God from Whom All Blessings",,"Thomas Ken",,8.8.8.8,"OLD HUNDREDTH",old_hundredth_bourgeois,117651233332143,English,<cite>Doxology</cite>,"<i>Genevan Psalter</i>, 1551, alt."
"Praise God, from Whom All Blessings Flow","Praise God, from whom all blessings flow",praise_god_from_whom_all_blessings_ken,"Moravian Book of Worship",Mor1995,817,"Praise God, from Whom All Blessings Flow",,"Thomas Ken",,8.8.8.8,"OLD HUNDREDTH",old_hundredth_bourgeois,117651233332143,English,,"Genevan Psalter (1551), original form"
"Praise God, from Whom All Blessings Flow","Praise God, from whom all blessings flow",praise_god_from_whom_all_blessings_ken,"Lift Up Your Hearts: psalms, hymns, and spiritual songs",LUYH2013,964,"Praise God, from Whom All Blessings Flow",,"Thomas Ken, 1637-1711",,8.8.8.8,"NEW DOXOLOGY",new_doxology,,English,,"traditional Black Gospel"
"Praise God, from Whom All Blessings Flow","Praise God from whom all blessings flow (A Deus, supremo benfeitor)(만복의근일하나님)(Oo ne la nuh hiIikidodah)(Bóhólníihii baa dahohniih)(Gott Vater, dem sei ewig Herr)(Gloire à Dieu)(A Dios, el Padre celestial)(Aan God de Vader zij de eer)(たたえよ主の民)(颂赞上主万福之源)",praise_god_from_whom_all_blessings_ken,"Lift Up Your Hearts: psalms, hymns, and spiritual songs",LUYH2013,965,"Praise God, from Whom All Blessings Flow",,"Thomas Ken; Sarah Poulton Kalley; J. W. Nordholt; Martin Luther; Ambrose, 340-397","Louis Bourgeois",8.8.8.8,"GENEVAN 134/OLD HUNDREDTH",old_hundredth_bourgeois,117651233332143,"Cherokee; Dutch; English; French; German; Japanese; Korean; Mandarin; Navajo; Portugese; Spanish","Korean tr. The United Methodist Korean Hymnal Committee; Cherokee tr. traditional; Mohawk tr. traditional",
"Psalm 150 (A Responsorial Setting)","All creation join to say: Alleluia!",christ_the_lord_is_risen_today_wesley,"Psalms for All Seasons: a complete Psalter for worship",PFAS2012,150G(alt1),"Psalm 150 (A Responsorial Setting)",,"Charles Wesley, 1707-1788",,,"EASTER HYMN (fragment)",easter_hymn_lyra_davidica,135146653451434,,"<cite>Evangelical Lutheran Worship</cite> (Psalm text)","<cite>Lyra Davidica,</cite> 1708"
"Christ the Lord Is Risen Today!","""Christ the Lord is risen today!""",christ_the_lord_is_risen_today_wesley,"Glory to God: the Presbyterian Hymnal",GG2013,245,"Christ the Lord Is Risen Today!",,"Charles Wesley","Robert Williams; David Evans","7.7.7.7 with alleluia",LLANFAIR,llanfair_williams,113354325434321,English,,
"Christ, the Lord, Is Risen Today","Christ, the Lord, is ris'n today, Alleluia!",christ_the_lord_is_risen_today_wesley,"Glory and Praise (3rd. ed.)",GAP2015,320,"Christ, the Lord, Is Risen Today",,"Charles Wesley, 1707-1788","Robert Williams, 1781-1821; Randall DeBruyn, b. 1947","7.7.7.7 with alleluias",LLANFAIR,llanfair_williams,113354325434321,English,,
"Christ, the Lord, Is Risen Today","Christ, the Lord, is ris'n today, Alleluia!",christ_the_lord_is_risen_today_wesley,"Journeysongs (3rd ed.)",JS2012,403,"Christ, the Lord, Is Risen Today",,"Charles Wesley, 1707-1788","Robert Williams, 1781-1821; Randall DeBruyn, b. 1947","7.7.7.7 with alleluias",LLANFAIR,llanfair_williams,113354325434321,English,,
"O worship the King, all-glorious above","O worship the King, all-glorious above",o_worship_the_king_all_glorious_above,"The Presbyterian Book of Praise: approved and commended by the General Assembly of the Presbyterian Church in Canada, with Tunes",PBPT1897,22,,,"Sir Robert Grant","H. J. Gauntlett",10.10.11.11,HOUGHTON,houghton_gauntlett,531655316514425,English,,
"Before Jehovah's awful throne","Before Jehovah's awful throne",before_jehovahs_awful_throne,"The Presbyterian Book of Praise: approved and commended by the General Assembly of the Presbyterian Church in Canada, with Tunes",PBPT1897,14,,,"Isaac Watts; John Wesley",,8.8.8.8,"OLD HUNDREDTH",old_hundredth_bourgeois,117651233332143,English,,"'Genevan Psalter,' 1551."
"Jesus Calls Us; O'er the Tumult","Jesus calls us; o'er the tumult",jesus_calls_us_oer_the_tumult,"Psalter Hymnal (Blue)",BPsH,459,"Jesus Calls Us; O'er the Tumult",,"Mrs. Cecil F. Alexander","William H. Jude",8.7.8.7,"GALILEE (JUDE)",galilee_jude,352225111116123,English,,
"Praise the Lord! Ye Heavens, Adore Him","Praise the Lord! Ye heavens, adore him",praise_the_lord_ye_heavens_adore_him,"Rejoice in the Lord",RITL1985,3,"Praise the Lord! Ye Heavens, Adore Him",,,"F. J. Haydn","8.7.8.7 D",AUSTRIA,austrian_hymn_haydn,123243271654323,English,"<i>Foundling Hospital Collection,</i> Anon., c. 1798",
"praise from the whole Creation","Praise the Lord, ye heavens adore him",praise_the_lord_ye_heavens_adore_him,"Many Voices; or, Carmina Sanctorum, Evangelistic Edition with Tunes",MVCS1891,5,"praise from the whole Creation",,"Rev. John Kempthorne? (1775-1838)","Ithamar Conkey (1815-1867)",,RATHBUN,rathbun_conkey,513176515563234,English,,
"Praise the Lord, ye heavens adore him","Praise the Lord, ye heavens adore him",praise_the_lord_ye_heavens_adore_him,"Carmina Sanctorum, a selection of hymns and songs of praise with tunes",CS1886,11,,,"Rev. John Kempthorne (1775-1838)","Ithamar Conkey (1815-1867)",,RATHBUN,rathbun_conkey,513176515563234,English,,
"Praise the Lord! ye heavens, adore Him","Praise the Lord! ye heavens, adore Him",praise_the_lord_ye_heavens_adore_him,"The Presbyterian Book of Praise: approved and commended by the General Assembly of the Presbyterian Church in Canada, with Tunes",PBPT1897,21a,,,Anon.,"His Royal Highness Prince Albert",8.7.8.7,GOTHA,gotha_albert,"55314432 3455665",English,,
"Praise the Lord! ye heavens, adore Him","Praise the Lord! ye heavens, adore Him",praise_the_lord_ye_heavens_adore_him,"The Presbyterian Book of Praise: approved and commended by the General Assembly of the Presbyterian Church in Canada, with Tunes",PBPT1897,21b,,,Anon.,"Samuel Smith",8.7.8.7,"NEWTON FERNS",newton_ferns_smith,536425311765427,English,,
"Praise Ye the Lord","Praise ye the Lord, ye heav'ns adore him",praise_the_lord_ye_heavens_adore_him,"The Christian Hymnary. Bks. 1-4",CHB41972,56,"Praise Ye the Lord",,"John Kempthorne, 1775-1838; Thomas Kelley, 1769-1855; Reginald Heber, 1783-1826; John J. Overholt","Justin H. Knecht, 1752-1817",9.9.8.9.9.8.9.8.9.8,"HERR, DIR IST NIEMAND ZU VERGLEICHEN",herr_dir_ist_niemand_knecht,111314321333234332,English,,
