displayTitle,firstLine,textAuthNumber,hymnalTitle,hymnalID,number,textTitle,refrainFirstLine,authors,composers,meter,tuneTitle,tuneAuthNumber,incipit,languages,textSources,tuneSources
"I Need to Be Filled","I need to be filled with the Spirit",i_need_to_be_filled_with_the_spirit,"The Cyber Hymnal",CYBER,3004,"I Need to Be Filled","I need to be filled, Lord Jesus","Ada Ruth Habershon","Robert Harkness",,"[I need to be filled with the Spirit]",i_need_to_be_filled_with_the_harkness,511132161651235,English,,
"I Need to Be Filled With the Spirit","I need to be filled with the Spirit",i_need_to_be_filled_with_the_spirit,"Songs of the Assembly: No. 1",SoA11916,62,"I Need to Be Filled With the Spirit","I need to be filled, Lord Jesus","Ada R. Habershon","B. D. Ackley",,"[I need to be filled with the Spirit]",i_need_to_be_filled_with_the_ackley,,English,,
"I Need to Be Filled With the Spirit","I need to be filled with the Spirit",i_need_to_be_filled_with_the_spirit,"Victorious Life Hymns",VLH1919,180,"I Need to Be Filled With the Spirit",,"Ada R. Habershon","B. D. Ackley",,"[I need to be filled with the Spirit]",i_need_to_be_filled_with_the_ackley,,,,
"I Need to Be Filled With the Spirit","I need to be filled with the Spirit",i_need_to_be_filled_with_the_spirit,"Montreat Hymns: psalms and gospel songs with responsive scripture readings",MH1916,339,"I Need to Be Filled With the Spirit",,"Ada R. Habershon","B. D. Ackley",,"[I need to be filled with the Spirit]",i_need_to_be_filled_with_the_ackley,,English,,
"I Need to Be Filled","I need to be filled with the Spirit",i_need_to_be_filled_with_the_spirit,"The Service Hymnal: Compiled for general use in all religious services of the Church, School and Home",SHGU1935,124,"I Need to Be Filled","I need to be filled, Lord Jesus","Ada R. Habershon","Robert Harkness",,"[I need to be filled with the Spirit]",i_need_to_be_filled_with_the_harkness,511132161651235,English,,
"I need to be filled with the Spirit","I need to be filled with the Spirit",i_need_to_be_filled_with_the_spirit,"Devotional Hymns",DH1957,ad97,,,"Ada R. Habershon",,,,,,English,,
"I need to be filled with the Spirit","I need to be filled with the Spirit",i_need_to_be_filled_with_the_spirit,"Work and Worship",WW1910,d25,,,"Ada R. Habershon",,,,,,English,,
"I need to be filled with the Spirit","I need to be filled with the Spirit",i_need_to_be_filled_with_the_spirit,"Devotional Hymns",DH1935,d96,,,"Ada R. Habershon",,,,,,English,,
"I need to be filled with the Spirit","I need to be filled with the Spirit",i_need_to_be_filled_with_the_spirit,"Devotional Hymns",DH1947,d97,,,"Ada R. Habershon",,,,,,English,,
