displayTitle,firstLine,textAuthNumber,hymnalTitle,hymnalID,number,textTitle,refrainFirstLine,authors,composers,meter,tuneTitle,tuneAuthNumber,incipit,languages,textSources,tuneSources
"All the Way Along","There is One who loves me, One who is my friend",there_is_one_who_loves_me_one_who_is_my_,"The Cyber Hymnal",CYBER,303,"All the Way Along",,"Ada Blenkhorn","Lewis Edgar Jones",,"[There is One who loves me, One who is my friend]",there_is_one_who_loves_me_jones,555565111233221,English,,
"All the Way Along","There is One Who loves me, One Who is my Friend",there_is_one_who_loves_me_one_who_is_my_,"Songs of Full Salvation",SoFS1924,14,"All the Way Along","All the way along it is Jesus","Ada Blenkhorn","L. E. Jones",,"[There is One Who loves me, One Who is my Friend]",there_is_one_who_loves_me_jones,555565111233221,,,
"All the Way Along","There is One Who loves me, One Who is my Friend",there_is_one_who_loves_me_one_who_is_my_,"Revival Melodies",RM1921,14,"All the Way Along","All the way along it is Jesus","Ada Blenkhorn","L. E. Jones",,"[There is One Who loves me, One Who is my Friend]",there_is_one_who_loves_me_jones,555565111233221,English,,
"All the Way Along","There is One Who loves me, One Who is my Friend",there_is_one_who_loves_me_one_who_is_my_,"Full Gospel Songs",FGS1941,14,"All the Way Along","All the way along it is Jesus","Ada Blenkhorn","L. E. Jones",,"[There is One Who loves me, One Who is my Friend]",there_is_one_who_loves_me_jones,555565111233221,English,,
"All the Way Along","There is One who loves me, One who is my friend",there_is_one_who_loves_me_one_who_is_my_,"Waves of Glory No. 2",WG21921,14,"All the Way Along","All the way along it is Jesus","Ada Blenkhorn","L. E. Jones",,"[There is One who loves me, One who is my friend]",there_is_one_who_loves_me_jones,555565111233221,English,,
"All the Way Along","There is One Who loves me, One Who is my Friend",there_is_one_who_loves_me_one_who_is_my_,"Great Tabernacle Hymns",GTH1916,64,"All the Way Along","All the way along it is Jesus","Ada Blenkhorn","L. E. Jones",,"[There is One Who loves me, One Who is my Friend]",there_is_one_who_loves_me_jones,555565111233221,English,,
"All the Way Along","There is One Who loves me, One Who is my Friend",there_is_one_who_loves_me_one_who_is_my_,"Devotion and Praise",DV1937,85,"All the Way Along","All the way along it is Jesus","Ada Blenkhorn","L. E. Jones",,"[There is One Who loves me, One Who is my Friend]",there_is_one_who_loves_me_jones,555565111233221,English,,
"All the Way Along","There is One who loves me, One who is my friend",there_is_one_who_loves_me_one_who_is_my_,"Gospel Carols",GC1905,159,"All the Way Along","All the way along it is Jesus","Ada Blenkhorn","L. E. Jones",,"[There is One who loves me, One who is my friend]",there_is_one_who_loves_me_jones,555565111233221,English,,
"All the way along it is Jesus;","There is One who loves me",there_is_one_who_loves_me_one_who_is_my_,"Small Church Music",SCM,6687,,"All the way along it is Jesus;","Ada Blenkhorn","L. E. Jones",,"[There is One who loves me]",there_is_one_who_loves_me_jones,555565111233221,,,
"All the way along it is Jesus","There is one who loves me, one who is my friend",there_is_one_who_loves_me_one_who_is_my_,"Singspiration Six",SS1951,d12,,"All the way along it is Jesus","Ada Blenkhorn",,,,,,,,
"There is One who loves me","There is One who loves me",there_is_one_who_loves_me_one_who_is_my_,"Living Hymns: psalms, hymns, and spiritual songs of the faith",LH2019,64,,,,,,,,,English,,
"All the way along it is Jesus","There is one who loves me, one who is my friend",there_is_one_who_loves_me_one_who_is_my_,"Songs of Trust and Triumph No. 1",STT11929,d85,,"All the way along it is Jesus","Ada Blenkhorn",,,,,,,,
"All the way along it is Jesus","There is one who loves me, one who is my friend",there_is_one_who_loves_me_one_who_is_my_,"Hymns of Assurance, Containing 50 New Gospel Songs",HAC51932,d111,,"All the way along it is Jesus","Ada Blenkhorn",,,,,,English,,
"All the way along it is Jesus","There is one who loves me, one who is my friend",there_is_one_who_loves_me_one_who_is_my_,"Songs of Full Salvation",SoFS1920,d191,,"All the way along it is Jesus","Ada Blenkhorn",,,,,,English,,
"All the way along it is Jesus","There is one who loves me, one who is my friend",there_is_one_who_loves_me_one_who_is_my_,"Praise and Worship: the Nazarene Hymnal",PWNH1951,224,,"All the way along it is Jesus","Ada Blenkhorn",,,,,,English,,
"All the way along it is Jesus","There is one who loves me, one who is my friend",there_is_one_who_loves_me_one_who_is_my_,"Praise and Worship: hymnal",PWH1978,224,,"All the way along it is Jesus","Ada Blenkhorn",,,,,,English,,
"All the way along it is Jesus","There is one who loves me, one who is my friend",there_is_one_who_loves_me_one_who_is_my_,"Songs of hope",So1948,d231,,"All the way along it is Jesus","Ada Blenkhorn",,,,,,,,
