displayTitle,firstLine,textAuthNumber,hymnalTitle,hymnalID,number,textTitle,refrainFirstLine,authors,composers,meter,tuneTitle,tuneAuthNumber,incipit,languages,textSources,tuneSources
"Mercy for All","We are bought with a price by the Lamb that was slain",we_are_bought_with_a_price_by_the_lamb_t,"The Crowning Day : For use in Sunday Schools and Gospel Meetings",CD1894,82,"Mercy for All","Mercy for all!","Fanny Crosby","G. P. Benjamin",,"[We are bought with a price by the Lamb that was slain]",we_are_bought_with_a_price_benjamin,123345U1D76U1D651233,,,
"Mercy For All","We are bought with a price by the Lamb that was slain",we_are_bought_with_a_price_by_the_lamb_t,"The Cyber Hymnal",CYBER,8145,"Mercy For All",,"Frances Jane (Fanny) Crosby","Gabriel P. Benjamin",,"[We are bought with a price by the Lamb that was slain]",we_are_bought_with_a_price_benjamin,123345U1D76U1D651233,English,"<cite>The Victory</cite> by Chester G. Allen and William B. Bradbury (New York: Biglow & Main, 1869)",
"Mercy for All","We are bought with a price by the Lamb that was slain",we_are_bought_with_a_price_by_the_lamb_t,"Great Joy!: a new and favorite collection of hymns and music, for gospel meetings, prayer, temperance, and camp meetings, and Sunday schools",GJ1881,86,"Mercy for All","Mercy for all!","Fanny J. Crosby","G. P. Benjamin",,"[We are bought with a price by the Lamb that was slain]",we_are_bought_with_a_price_benjamin,123345U1D76U1D651233,English,,
"Mercy for All","We are bought with a price by the Lamb that was slain",we_are_bought_with_a_price_by_the_lamb_t,"Gospel Trio of Sacred Song: for Gospel Meetings, Christian Associations and Young People's Societies for Christian Work",GTSS1891,90,"Mercy for All","Mercy for all!","Fanny Crosby","G. P. Benjamin",,"[We are bought with a price by the Lamb that was slain]",we_are_bought_with_a_price_benjamin,123345U1D76U1D651233,English,,
"Mercy for All","We are bought with a price by the Lamb that was slain",we_are_bought_with_a_price_by_the_lamb_t,"Sunny-Side Songs for Sunday Schools",SSSS1893,170,"Mercy for All","Mercy for all!","Fanny Crosby","G. P. Benjamin",,"[We are bought with a price by the Lamb that was slain]",we_are_bought_with_a_price_benjamin,123345U1D76U1D651233,English,,
"Mercy for All","We are bought with a price by the Lamb that was slain",we_are_bought_with_a_price_by_the_lamb_t,"Garden of Spices: a choice collection for revival meetings, missionary meetings, rescue work, church and Sunday schools",GSCC1900,223,"Mercy for All","Mercy for all!","Fanny Crosby","G. P. Benjamin",,"[We are bought with a price by the Lamb that was slain]",we_are_bought_with_a_price_benjamin,123345U1D76U1D651233,English,,
"Mercy for all","We are bought with a price by the Lamb that was slain",we_are_bought_with_a_price_by_the_lamb_t,"Gems of Gladness for Sabbath School and Praise Meetings",GGSS1888,d41,,"Mercy for all","Fanny J. Crosby",,,,,,English,,
"Mercy for all","We are bought with a price by the Lamb that was slain",we_are_bought_with_a_price_by_the_lamb_t,"Songs of the Soul",SoS1889,d179,,"Mercy for all","Fanny J. Crosby",,,,,,,,
"Mercy for all","We are bought with a price by the Lamb that was slain",we_are_bought_with_a_price_by_the_lamb_t,"The Victory",V1869,d421,,"Mercy for all","Fanny J. Crosby",,,,,,,,
