hymnalTitle,displayTitle,firstLine,textAuthNumber,hymnalID,number,textTitle,refrainFirstLine,authors,composers,meter,tuneTitle,tuneAuthNumber,incipit,languages,textSources,tuneSources
Diamonds,"He will not let me fall","My faith temptation shall not move, for Jesus knows it all ",my_faith_temptation_shall_not_move_for_j,D1916,d126,,"He will not let me fall","A. H. Ackley",,,,,,English,,
"Gospel Melodies: A Collection of Choice Gospel Songs and Hymsn","He Will Not Let Me Fall","My faith temptation shall not move",my_faith_temptation_shall_not_move_for_j,GM1918,39,"He Will Not Let Me Fall","He will not let me fall","Rev. A. H. Ackley","B. D. Ackley",,"[My faith temptation shall not move]",my_faith_temptation_shall_not_ackley,516751355463622,English,,
"Great Revival Hymns","He Will Not Let Me Fall","My faith temptation shall not move",my_faith_temptation_shall_not_move_for_j,GRH1911,165,"He Will Not Let Me Fall","He will not let me fall","Rev. A. H. Ackley","B. D. Ackley",,"[My faith temptation shall not move]",my_faith_temptation_shall_not_ackley,516751355463622,English,,
"Great Revival Hymns No. 2","He Will Not Let Me Fall","My faith temptation shall not move",my_faith_temptation_shall_not_move_for_j,GRH21913,1,"He Will Not Let Me Fall","He will not let me fall","Rev. A. H. Ackley","B. D. Ackley",,"[My faith temptation shall not move]",my_faith_temptation_shall_not_ackley,516751355463622,English,,
"Hymns for His Praise  No. 2. Rev. ed.","He will not let me fall","My faith temptation shall not move, for Jesus knows it all",my_faith_temptation_shall_not_move_for_j,HHP21909,d105,,"He will not let me fall","A. H. Ackley",,,,,,English,,
"Select Gospel songs","He will not let me fall","My faith temptation shall not move, for Jesus knows it all ",my_faith_temptation_shall_not_move_for_j,SG1916,d77,,"He will not let me fall","A. H. Ackley",,,,,,English,,
"Select Revival Hymns : a collection of new and old hymns suitable for every department of church work, Bible school, young people's societies, prayer meetings, evangelistic services, Y.M.C.A...","He Will Not Let Me Fall","My faith temptation shall not move",my_faith_temptation_shall_not_move_for_j,SRH0,36,"He Will Not Let Me Fall","He will not let me fall!","Rev. A. H. Ackley","B. D. Ackley",,"[My faith temptation shall not move]",my_faith_temptation_shall_not_ackley,516751355463622,English,,
"Songs for Men: A Collection of Gospel Songs for Male Quartets and Choruses","He Will Not Let Me Fall","My faith temptation shall not move",my_faith_temptation_shall_not_move_for_j,S4M1913,121,"He Will Not Let Me Fall","He will not let me fall","Rev. A. H. Ackley","B. D. Ackley",,"[My faith temptation shall not move]",my_faith_temptation_shall_not_ackley,516751355463622,English,,
"Songs for Men: A Collection of Gospel Songs for Male Quartets and Choruses","He Will Not Let Me Fall","My faith temptation shall not move",my_faith_temptation_shall_not_move_for_j,S4M1949,121,"He Will Not Let Me Fall","He will not let me fall","Rev. A. H. Ackley","B. D. Ackley",,"[My faith temptation shall not move]",my_faith_temptation_shall_not_ackley,516751355463622,English,,
"Songs for Service","He Will Not Let Me Fall","My faith temptation shall not move",my_faith_temptation_shall_not_move_for_j,S4S1918,39,"He Will Not Let Me Fall","He will not let me fall","Rev. A. H. Ackley","B. D. Ackley",,"[My faith temptation shall not move]",my_faith_temptation_shall_not_ackley,516751355463622,English,,
"Songs of Redemption","He will not let me fall","My faith temptation shall not move, for Jesus knows it all ",my_faith_temptation_shall_not_move_for_j,SoR1920,d137,,"He will not let me fall","A. H. Ackley",,,,,,English,,
"Songs of the Tabernacle: for Church, Sunday School, young people's socieities, and Evangelistic Services","He Will Not Let Me Fall","My faith temptation shall not move",my_faith_temptation_shall_not_move_for_j,SoT1916,94,"He Will Not Let Me Fall","He will not let me fall","Rev. A. H. Ackley","B. D. Ackley",,"[My faith temptation shall not move]",my_faith_temptation_shall_not_ackley,516751355463622,English,,
"The Cyber Hymnal","He Will Not Let Me Fall","My faith temptation shall not move",my_faith_temptation_shall_not_move_for_j,CYBER,2685,"He Will Not Let Me Fall","He will not let me fall","Alfred Henry Ackley","Bentley DeForest Ackley",,"[My faith temptation shall not move]",my_faith_temptation_shall_not_ackley,516751355463622,English,,
"The Message in Song Nos. 1 & 2","He will not let me fall","My faith temptation shall not move, for Jesus knows it all ",my_faith_temptation_shall_not_move_for_j,MSN11914,d128,,"He will not let me fall","A. H. Ackley",,,,,,English,,
"The Voice of Thanksgiving","He Will Not Let Me Fall","My faith temptation shall not move",my_faith_temptation_shall_not_move_for_j,VoT11913,36,"He Will Not Let Me Fall","He will not let me fall","Rev. A. H. Ackley","B. D. Ackley",,"[My faith temptation shall not move]",my_faith_temptation_shall_not_ackley,516751355463622,,,
"Victorious Service Songs: Rodeheaver's combination song book for all services","He Will Not Let Me Fall","My faith temptation shall not move",my_faith_temptation_shall_not_move_for_j,VSS1925,17,"He Will Not Let Me Fall","He will not let me fall","Rev. A. H. Ackley","B. D. Ackley",,"[My faith temptation shall not move]",my_faith_temptation_shall_not_ackley,516751355463622,English,,
"Victory Songs: For the Church, Sunday School and Evangelistic Services.","He Will Not Let Me Fall.","My faith temptation shall not move",my_faith_temptation_shall_not_move_for_j,VS1920,101,"He Will Not Let Me Fall.","He will not let me fall","Rev. A. H. Ackley","B. D. Ackley",,"[My faith temptation shall not move]",my_faith_temptation_shall_not_ackley,516751355463622,English,,
"World Wide Revival Songs: for the Church, Sunday School and Evangelistic Meetings","He Will Not Let Me Fall","My faith temptation shall not move",my_faith_temptation_shall_not_move_for_j,WWRS1915,183,"He Will Not Let Me Fall","He will not let me fall","Rev. A. H. Ackley","B. D. Ackley",,"[My faith temptation shall not move]",my_faith_temptation_shall_not_ackley,516751355463622,English,,
