firstLine,displayTitle,textAuthNumber,hymnalTitle,hymnalID,number,textTitle,refrainFirstLine,authors,composers,meter,tuneTitle,tuneAuthNumber,incipit,languages,textSources,tuneSources
"Come, let us all with one accord","Come, let us all with one accord",come_let_us_all_with_one_accord,"Songs of Praise and Prayer : for the Sunday School and Social Meeting",SoPP1883,1,,,"H. M. C.","G. A. Macfarren",,ADORATION,adoration_macfarren,12345625123432543323,English,"English hymnal",
"Come, let us all with one accord","Come, let us all with one accord",come_let_us_all_with_one_accord,"Songs of Praise and Prayer: for the Sunday-school and social meeting",SoPP1889,1,,,"H. M. C.","G. A. Macfarren",,ADORATION,adoration_macfarren,12345625123432543323,English,"English hymnal",
"Come, let us all with one accord","Come, let us all with one accord",come_let_us_all_with_one_accord,"Songs of Worship: for the Sunday School",SWSS1887,5,,,"H. M. C.","G. A. Macfarren",,"[Come, let us all with one accord]",adoration_macfarren,12345625123432543323,English,,
"Come, let us all with one accord ","Come, let us all with one accord",come_let_us_all_with_one_accord,"The Hymnal, Revised and Enlarged, as adopted by the General Convention of the Protestant Episcopal Church in the United States of America in the year of our Lord 1892",HRGC1892,26,"Come, let us all with one accord",,"Mrs. Chester","W. H. Walter, Mus. Doc.",6.8.8,"[Come, let us all with one accord]",adoremus_walter,176655423345717,English,"Ancient hymn",
"Come, let us all with one accord ","Come, let us all with one accord ",come_let_us_all_with_one_accord,"The Church Hymnal: revised and enlarged in accordance with the action of the General Convention of the Protestant Episcopal Church in the United States of America in the year of our Lord 1892. (Ed. B)",HPEC1917,26,,,"H. M. Chester","H. W. Parker",6.8.8,"HOLY DAY",holy_day_parker,5571235432,English,,
"Come, let us all with one accord","Come, let us all with one accord",come_let_us_all_with_one_accord,"The Hymnal: revised and enlarged as adopted by the General Convention of the Protestant Episcopal Church in the United States of America in the of our Lord 1892..with music, as used in Trinity Church",HREA1893,26,,,Chester,,,,,,,Medieval,
"Come, let us all with one accord","Come, let us all with one accord",come_let_us_all_with_one_accord,"The Church Hymnal: revised and enlarged in accordance with the action of the General Convention of the Protestant Episcopal Church in the United States of America in the year of our Lord 1892...",CHRE1894,26,,,"H. M. Chester.",,,,,,,,
"Come, let us all with one accord","Come, let us all with one accord",come_let_us_all_with_one_accord,"The Catholic Hymnal: containing hymns for congregational and home use, and the vesper psalms, the office of compline, the litanies, hymns at benediction, etc.",CHCH1885,169,,,,,,,,,,,
"Come, let us all with one accord","Come, Let Us All with One Accord",come_let_us_all_with_one_accord,"The Cyber Hymnal",CYBER,916,"Come, Let Us All with One Accord",,"Anonymous; Henrietta M. Chester","H. W. Parker",8.8.6,"HOLY DAY (Parker)",holy_day_parker,557123543233365,English,"<cite>Elucidatorium of Clichtovaeus</cite> (Paris: 1516); Translation: <cite>Hymnary</cite>, 1872",
"Come, let us join with one accord","Come, let us join with one accord",come_let_us_all_with_one_accord,"Processional Hymns, for Use in the Cathedral of All Saints, Albany, New York",PHUC1878,d12,,,"Harriet M. Chester",,,,,,,,
"Come, let us join with one accord","Come, let us join with one accord",come_let_us_all_with_one_accord,"Christian Praise: a manual of worship for public, social and private devotion",CP1880,13,,,,,,,,,English,"H. M. C. in English Hymnary",
"Come, let us join with one accord","Come, let us join with one accord",come_let_us_all_with_one_accord,"Songs of Christian Praise with Music",SCPM1880,d91,,,"Harriet M. Chester",,,,,,,,
"O come and let us all with one accord","O come and let us all with one accord",o_come_and_let_us_all_with_one_accord,"The New Laudes Domini: a selection of spiritual songs, ancient and modern for use in Baptist churches",NLD1892,3,,,Anon.,,,,,,English,,
"O come, and let us all, with one accord","O come, and let us all, with one accord",o_come_and_let_us_all_with_one_accord,"Sursum Corda: a book of praise",SCW1898,27,,,Anon.,,,,,,,,
"O come and let us all with one accord","O come and let us all with one accord",o_come_and_let_us_all_with_one_accord,"Laudes Domini: a selection of spiritual songs ancient and modern",LD1884,67,,,,,,,,,English,,
"O, come and let us all, with one accord","O, come and let us all, with one accord",o_come_and_let_us_all_with_one_accord,"Hymns of the Spirit",HoS1864,104,,,,,,,,,English,,
"O come and let us all with one accord","O come and let us all with one accord",o_come_and_let_us_all_with_one_accord,"Angelic Songs",AS1896,d129,,,,,,,,,English,,
"Oh, come, and let us all, with one accord","Oh, come, and let us all, with one accord",o_come_and_let_us_all_with_one_accord,"Sacred Songs for School Use",SSSU1901,1,,,Anon.,"Lowell Mason",,ERNAN,ernan_mason,534511767166655,English,,
