hymnalTitle,displayTitle,firstLine,textAuthNumber,hymnalID,number,textTitle,refrainFirstLine,authors,composers,meter,tuneTitle,tuneAuthNumber,incipit,languages,textSources,tuneSources
"Hymnal and Canticles of the Protestant Episcopal Church with Music (Gilbert & Goodrich)","O with due reverence let us all","O with due reverence let us all",o_with_due_reverence_let_us_all,HPEC1890,280,,,,,8.6.8.6,COVENTRY,coventry_english,551171654435556,English,,
"Hymnal: according to the use of the Protestant Episcopal Church in the United States of America","O with due reverence let us all","O with due reverence let us all",o_with_due_reverence_let_us_all,HPEC1871,280,,,,,8.6.8.6,,,,English,,
"Hymnal: according to the use of the Protestant Episcopal Church in the United States of America : Revised edition (1874)","O with due reverence let us all","O with due reverence let us all",o_with_due_reverence_let_us_all,HPEC1874,280,,,,,8.6.8.6,,,,English,,
"Selections from the Psalms of David in Metre: with hymns suited to the feasts and fasts of the church, and other occasions of public worship","O with due reverence let us all","O with due reverence let us all",o_with_due_reverence_let_us_all,SPDM1832,106,,,,,,,,,,,
"The Book of Worship","Oh with due reverence let us all","Oh with due reverence let us all",o_with_due_reverence_let_us_all,BW1867,3,,,,,8.6.8.6,,,,English,,
"The Church Hymnal with Canticles","O with due reverence let us all","O with due reverence let us all",o_with_due_reverence_let_us_all,CHC1890,280,,,,,,,,,,,
"The Church Hymnal: a collection of hymns from the Prayer book hymnal, Additional hymns, and Hymns ancient and modern, and Hymns for church and home. For use in Churches where licensed by the Bishop","O, with due rev'rence, let us all","O, with due rev'rence, let us all",o_with_due_reverence_let_us_all,CHCH1869,153,,,,,,,,,,,
"The Church Hymnal: revised and enlarged in accordance with the action of the General Convention of the Protestant Episcopal Church in the United States of America in the year of our Lord 1892. (Ed. B)","O with due rev'rence let us all","O with due rev'rence let us all",o_with_due_reverence_let_us_all,HPEC1917,479,,,,,8.6.8.6,DUNDEE,dundee_ravenscroft,134512343211715,,"Tate and Brady","Scottish Psalter"
"The Church Hymnal: revised and enlarged in accordance with the action of the General Convention of the Protestant Episcopal Church in the United States of America in the year of our Lord 1892...","O with due rev'rence let us all","O with due rev'rence let us all",o_with_due_reverence_let_us_all,CHRE1894,479,,,,,,,,,,"Tate and Brady",
"The Churchman's Hymn-Book, a Collection of Hymns Old and New, for Use in the Services of the Church","O with due reverence let us all","O with due reverence let us all",o_with_due_reverence_let_us_all,CHBC1874,d302,,,,,,,,,,,
"The Hymnal, Revised and Enlarged, as adopted by the General Convention of the Protestant Episcopal Church in the United States of America in the year of our Lord 1892","Oh, with due reverence let us all","Oh, with due reverence let us all",o_with_due_reverence_let_us_all,HRGC1892,479,"Oh, with due reverence let us all",,"N. Tate; N. Brady","J. F. Burrowes",8.6.8.6,"[Oh, with due reverence let us all]",burlington_burrowes,123423651256576,English,,
"The Hymnal: revised and enlarged as adopted by the General Convention of the Protestant Episcopal Church in the United States of America in the of our Lord 1892..with music, as used in Trinity Church","Oh, with due rev'rence let us all","Oh, with due rev'rence let us all",o_with_due_reverence_let_us_all,HREA1893,479,,,,,,,,,,"Tate and Brady, 1698",
"The Hymnal: with tunes old and new","O with due reverence let us all","O with due reverence let us all",o_with_due_reverence_let_us_all,HWTO1872,280,,,,,,,,,,,
"The Lecture-Room Hymn-Book: containing the psalms and hymns of the book of common prayer, together with a choice selection of additional hymns, and an appendix of chants and tunes...","O with due reverence let us all","O with due reverence let us all",o_with_due_reverence_let_us_all,LRHB1855,S106,,,,,,,,,,,
